7879 questions

9306 answers

14978 comments

12784 members

0 votes
34 views 0 comments
by

Hi, I'm trying to compile firmware from SDK for RUT955, from this archive: RUT9_R_GPL_00.07.00.tar.gz 

Unfortunately, when running make, I encounter some errors and firmware fails to build. I'm running this on Ubuntu 20.10 virtual machine. Can you help me get this working?

It finished with (stderr output log):

OpenWrt-libtool: install: warning: remember to run `libtool --finish /usr/lib'

OpenWrt-libtool: install: warning: `../lib/libipset.la' has not been installed in `/usr/lib'

gzip: /home/osboxes/rutos-ath79-rut9-gpl/dl/coova-chilli-e50fb309cfd1008f1e53c960ce3779ff0e9e732f-2021-06-22.tar.gz: No such file or directory

tar: This does not look like a tar archive

tar: Exiting with failure status due to previous errors

configure.ac:17: installing './compile'

configure.ac:26: installing './config.guess'

configure.ac:26: installing './config.sub'

configure.ac:8: installing './install-sh'

configure.ac:8: installing './missing'

Makefile.am: error: required file './README' not found

bstring/Makefile.am: installing './depcomp'

Makefile.am: error: required file './README' not found

make[3]: *** [Makefile:175: /home/osboxes/rutos-ath79-rut9-gpl/build_dir/target-mips_24kc_musl/coova-chilli-e50fb309cfd1008f1e53c960ce3779ff0e9e732f-2021-06-22/.prepared_9cf3317d7ea9945dc9568efec747447b_6664517399ebbbc92a37c5bb081b5c53] Error 1

make[2]: *** [package/Makefile:125: package/teltonika/coova-chilli/compile] Error 2

make[1]: *** [package/Makefile:119: /home/osboxes/rutos-ath79-rut9-gpl/staging_dir/target-mips_24kc_musl/stamp/.package_compile] Error 2

make: *** [/home/osboxes/rutos-ath79-rut9-gpl/include/toplevel.mk:231: world] Error 2

1 Answer

0 votes
ago by
Hello, please try compiling on Ubuntu 20.04 distribution. Also, please re-download the archive from here: https://wiki.teltonika-networks.com/view/Software_Development_Kit