8384 questions

9850 answers

15651 comments

14098 members

+1 vote
42 views 3 comments
by
Hello,

This SDK lacks several files in coova-chilli easycwmp ... and cannot be compiled. The previous version was fine.

Regards,

1 Answer

0 votes
by
Hi,

Could you provide a whole output log that you receive when you try to compile SDK?

Regards.
by

You can see logs in this ticket.

by
I have checked out the query you have linked, I have seen logs related to coova-chilli but not to easycwmp.
by

For easycwmp (missing README, maybe other files):

make[3]: Entering directory '/home/fl/tmp/rutos-ipq40xx-rutx-gpl/package/teltonika/easycwmp'
rm -f /home/fl/tmp/rutos-ipq40xx-rutx-gpl/build_dir/target-arm_cortex-a7+neon-vfpv4_musl_eabi/easycwmp-f7fbee5af227d95aba001ba30b1bb03dddebeac8-2020-12-22/.configured_*
rm -f /home/fl/tmp/rutos-ipq40xx-rutx-gpl/staging_dir/target-arm_cortex-a7+neon-vfpv4_musl_eabi/stamp/.easycwmp_installed
(cd /home/fl/tmp/rutos-ipq40xx-rutx-gpl/build_dir/target-arm_cortex-a7+neon-vfpv4_musl_eabi/easycwmp-f7fbee5af227d95aba001ba30b1bb03dddebeac8-2020-12-22; rm -f aclocal.m4; if [ -f ./configure.ac ] || [ -f ./configure.in ]; then [ -d ./autom4te.cache ] && rm -rf autom4te.cache; [ -e ./config.rpath ] || ln -s /home/fl/tmp/rutos-ipq40xx-rutx-gpl/scripts/config.rpath ./config.rpath; touch NEWS AUTHORS COPYING ABOUT-NLS ChangeLog; AUTOM4TE=/home/fl/tmp/rutos-ipq40xx-rutx-gpl/staging_dir/host/bin/autom4te AUTOCONF=/home/fl/tmp/rutos-ipq40xx-rutx-gpl/staging_dir/host/bin/autoconf AUTOMAKE=/home/fl/tmp/rutos-ipq40xx-rutx-gpl/staging_dir/host/bin/automake ACLOCAL=/home/fl/tmp/rutos-ipq40xx-rutx-gpl/staging_dir/host/bin/aclocal AUTOHEADER=/home/fl/tmp/rutos-ipq40xx-rutx-gpl/staging_dir/host/bin/autoheader LIBTOOLIZE=/home/fl/tmp/rutos-ipq40xx-rutx-gpl/staging_dir/host/bin/libtoolize LIBTOOL=/home/fl/tmp/rutos-ipq40xx-rutx-gpl/staging_dir/host/bin/libtool M4=/home/fl/tmp/rutos-ipq40xx-rutx-gpl/staging_dir/host/bin/m4 AUTOPOINT=true LIBTOOLIZE='/home/fl/tmp/rutos-ipq40xx-rutx-gpl/staging_dir/host/bin/libtoolize --install' /home/fl/tmp/rutos-ipq40xx-rutx-gpl/staging_dir/host/bin/autoreconf -v -f -i -s -B /home/fl/tmp/rutos-ipq40xx-rutx-gpl/staging_dir/host/share/aclocal -I /home/fl/tmp/rutos-ipq40xx-rutx-gpl/staging_dir/target-arm_cortex-a7+neon-vfpv4_musl_eabi/host/share/aclocal -I /home/fl/tmp/rutos-ipq40xx-rutx-gpl/staging_dir/hostpkg/share/aclocal -I /home/fl/tmp/rutos-ipq40xx-rutx-gpl/staging_dir/target-arm_cortex-a7+neon-vfpv4_musl_eabi/usr/share/aclocal -I m4 -I . . || true; fi; );
autoreconf: Entering directory `.'
autoreconf: configure.ac: not using Gettext
autoreconf: running: /home/fl/tmp/rutos-ipq40xx-rutx-gpl/staging_dir/host/bin/aclocal -I /home/fl/tmp/rutos-ipq40xx-rutx-gpl/staging_dir/target-arm_cortex-a7+neon-vfpv4_musl_eabi/host/share/aclocal -I /home/fl/tmp/rutos-ipq40xx-rutx-gpl/staging_dir/hostpkg/share/aclocal -I /home/fl/tmp/rutos-ipq40xx-rutx-gpl/staging_dir/target-arm_cortex-a7+neon-vfpv4_musl_eabi/usr/share/aclocal -I m4 -I . --force 
autoreconf: configure.ac: tracing
autoreconf: configure.ac: not using Libtool
autoreconf: running: /home/fl/tmp/rutos-ipq40xx-rutx-gpl/staging_dir/host/bin/autoconf --include=/home/fl/tmp/rutos-ipq40xx-rutx-gpl/staging_dir/target-arm_cortex-a7+neon-vfpv4_musl_eabi/host/share/aclocal --include=/home/fl/tmp/rutos-ipq40xx-rutx-gpl/staging_dir/hostpkg/share/aclocal --include=/home/fl/tmp/rutos-ipq40xx-rutx-gpl/staging_dir/target-arm_cortex-a7+neon-vfpv4_musl_eabi/usr/share/aclocal --include=m4 --include=. --prepend-include=/home/fl/tmp/rutos-ipq40xx-rutx-gpl/staging_dir/host/share/aclocal --force
autoreconf: configure.ac: not using Autoheader
autoreconf: running: /home/fl/tmp/rutos-ipq40xx-rutx-gpl/staging_dir/host/bin/automake --add-missing --force-missing
Makefile.am: error: required file './README' not found
autoreconf: /home/fl/tmp/rutos-ipq40xx-rutx-gpl/staging_dir/host/bin/automake failed with exit status: 1
(cd /home/fl/tmp/rutos-ipq40xx-rutx-gpl/build_dir/target-arm_cortex-a7+neon-vfpv4_musl_eabi/easycwmp-f7fbee5af227d95aba001ba30b1bb03dddebeac8-2020-12-22/./; if [ -x ./configure ]; then find /home/fl/tmp/rutos-ipq40xx-rutx-gpl/build_dir/target-arm_cortex-a7+neon-vfpv4_musl_eabi/easycwmp-f7fbee5af227d95aba001ba30b1bb03dddebeac8-2020-12-22/ -name config.guess | xargs -r chmod u+w; find /home/fl/tmp/rutos-ipq40xx-rutx-gpl/build_dir/target-arm_cortex-a7+neon-vfpv4_musl_eabi/easycwmp-f7fbee5af227d95aba001ba30b1bb03dddebeac8-2020-12-22/ -name config.guess | xargs -r -n1 cp --remove-destination /home/fl/tmp/rutos-ipq40xx-rutx-gpl/scripts/config.guess; find /home/fl/tmp/rutos-ipq40xx-rutx-gpl/build_dir/target-arm_cortex-a7+neon-vfpv4_musl_eabi/easycwmp-f7fbee5af227d95aba001ba30b1bb03dddebeac8-2020-12-22/ -name config.sub | xargs -r chmod u+w; find /home/fl/tmp/rutos-ipq40xx-rutx-gpl/build_dir/target-arm_cortex-a7+neon-vfpv4_musl_eabi/easycwmp-f7fbee5af227d95aba001ba30b1bb03dddebeac8-2020-12-22/ -name config.sub | xargs -r -n1 cp --remove-destination /home/fl/tmp/rutos-ipq40xx-rutx-gpl/scripts/config.sub; AR="arm-openwrt-linux-muslgnueabi-gcc-ar" AS="arm-openwrt-linux-muslgnueabi-gcc -c -Os -pipe -fno-caller-saves -fno-plt -fhonour-copts -Wno-error=unused-but-set-variable -Wno-error=unused-result -mfloat-abi=hard -iremap/home/fl/tmp/rutos-ipq40xx-rutx-gpl/build_dir/target-arm_cortex-a7+neon-vfpv4_musl_eabi/easycwmp-f7fbee5af227d95aba001ba30b1bb03dddebeac8-2020-12-22:easycwmp-f7fbee5af227d95aba001ba30b1bb03dddebeac8-2020-12-22 -Wformat -Werror=format-security -fstack-protector -D_FORTIFY_SOURCE=1 -Wl,-z,now -Wl,-z,relro -D_GNU_SOURCE" LD=arm-openwrt-linux-muslgnueabi-ld NM="arm-openwrt-linux-muslgnueabi-gcc-nm" CC="arm-openwrt-linux-muslgnueabi-gcc" GCC="arm-openwrt-linux-muslgnueabi-gcc" CXX="arm-openwrt-linux-muslgnueabi-g++" RANLIB="arm-openwrt-linux-muslgnueabi-gcc-ranlib" STRIP=arm-openwrt-linux-muslgnueabi-strip OBJCOPY=arm-openwrt-linux-muslgnueabi-objcopy OBJDUMP=arm-openwrt-linux-muslgnueabi-objdump SIZE=arm-openwrt-linux-muslgnueabi-size CFLAGS="-Os -pipe -fno-caller-saves -fno-plt -fhonour-copts -Wno-error=unused-but-set-variable -Wno-error=unused-result -mfloat-abi=hard -iremap/home/fl/tmp/rutos-ipq40xx-rutx-gpl/build_dir/target-arm_cortex-a7+neon-vfpv4_musl_eabi/easycwmp-f7fbee5af227d95aba001ba30b1bb03dddebeac8-2020-12-22:easycwmp-f7fbee5af227d95aba001ba30b1bb03dddebeac8-2020-12-22 -Wformat -Werror=format-security -fstack-protector -D_FORTIFY_SOURCE=1 -Wl,-z,now -Wl,-z,relro -D_GNU_SOURCE " CXXFLAGS="-Os -pipe -fno-caller-saves -fno-plt -fhonour-copts -Wno-error=unused-but-set-variable -Wno-error=unused-result -mfloat-abi=hard -iremap/home/fl/tmp/rutos-ipq40xx-rutx-gpl/build_dir/target-arm_cortex-a7+neon-vfpv4_musl_eabi/easycwmp-f7fbee5af227d95aba001ba30b1bb03dddebeac8-2020-12-22:easycwmp-f7fbee5af227d95aba001ba30b1bb03dddebeac8-2020-12-22 -Wformat -Werror=format-security -fstack-protector -D_FORTIFY_SOURCE=1 -Wl,-z,now -Wl,-z,relro -D_GNU_SOURCE " CPPFLAGS="-I/home/fl/tmp/rutos-ipq40xx-rutx-gpl/staging_dir/target-arm_cortex-a7+neon-vfpv4_musl_eabi/usr/include -I/home/fl/tmp/rutos-ipq40xx-rutx-gpl/staging_dir/target-arm_cortex-a7+neon-vfpv4_musl_eabi/include -I/home/fl/tmp/rutos-ipq40xx-rutx-gpl/staging_dir/toolchain-arm_cortex-a7+neon-vfpv4_gcc-7.5.0_musl_eabi/usr/include -I/home/fl/tmp/rutos-ipq40xx-rutx-gpl/staging_dir/toolchain-arm_cortex-a7+neon-vfpv4_gcc-7.5.0_musl_eabi/include/fortify -I/home/fl/tmp/rutos-ipq40xx-rutx-gpl/staging_dir/toolchain-arm_cortex-a7+neon-vfpv4_gcc-7.5.0_musl_eabi/include -DRUTX_PLATFORM -DMOBILE_SUPPORT -DDUAL_SIM_SUPPORT -DGPS_SUPPORT -DBLUETOOTH_SUPPORT -DWIFI_SUPPORT " LDFLAGS="-L/home/fl/tmp/rutos-ipq40xx-rutx-gpl/staging_dir/target-arm_cortex-a7+neon-vfpv4_musl_eabi/usr/lib -L/home/fl/tmp/rutos-ipq40xx-rutx-gpl/staging_dir/target-arm_cortex-a7+neon-vfpv4_musl_eabi/lib -L/home/fl/tmp/rutos-ipq40xx-rutx-gpl/staging_dir/toolchain-arm_cortex-a7+neon-vfpv4_gcc-7.5.0_musl_eabi/usr/lib -L/home/fl/tmp/rutos-ipq40xx-rutx-gpl/staging_dir/toolchain-arm_cortex-a7+neon-vfpv4_gcc-7.5.0_musl_eabi/lib -znow -zrelro -Wl,-rpath-link=/home/fl/tmp/rutos-ipq40xx-rutx-gpl/staging_dir/target-arm_cortex-a7+neon-vfpv4_musl_eabi/usr/lib "   ./configure --target=arm-openwrt-linux --host=arm-openwrt-linux --build=x86_64-pc-linux-gnu --program-prefix="" --program-suffix="" --prefix=/usr --exec-prefix=/usr --bindir=/usr/bin --sbindir=/usr/sbin --libexecdir=/usr/lib --sysconfdir=/etc --datadir=/usr/share --localstatedir=/var --mandir=/usr/man --infodir=/usr/info --disable-nls  --with-uci-include-path=/home/fl/tmp/rutos-ipq40xx-rutx-gpl/staging_dir/target-arm_cortex-a7+neon-vfpv4_musl_eabi/usr/include --with-libubox-include-path=/home/fl/tmp/rutos-ipq40xx-rutx-gpl/staging_dir/target-arm_cortex-a7+neon-vfpv4_musl_eabi/usr/include --with-libubus-include-path=/home/fl/tmp/rutos-ipq40xx-rutx-gpl/staging_dir/target-arm_cortex-a7+neon-vfpv4_musl_eabi/usr/include --enable-jsonc=1 ; fi; )
configure: WARNING: unrecognized options: --disable-nls
configure: loading site script /home/fl/tmp/rutos-ipq40xx-rutx-gpl/include/site/arm
checking for a BSD-compatible install... /usr/bin/install -c
checking whether build environment is sane... yes
checking for arm-openwrt-linux-strip... arm-openwrt-linux-muslgnueabi-strip
checking for a thread-safe mkdir -p... /usr/bin/mkdir -p
checking for gawk... gawk
checking whether make sets $(MAKE)... yes
checking whether make supports nested variables... yes
checking for arm-openwrt-linux-gcc... arm-openwrt-linux-muslgnueabi-gcc
checking whether the C compiler works... yes
checking for C compiler default output file name... a.out
checking for suffix of executables... 
checking whether we are cross compiling... yes
checking for suffix of object files... o
checking whether we are using the GNU C compiler... yes
checking whether arm-openwrt-linux-muslgnueabi-gcc accepts -g... yes
checking for arm-openwrt-linux-muslgnueabi-gcc option to accept ISO C89... none needed
checking whether arm-openwrt-linux-muslgnueabi-gcc understands -c and -o together... yes
checking for style of include used by make... GNU
checking dependency style of arm-openwrt-linux-muslgnueabi-gcc... gcc3
checking dependency style of arm-openwrt-linux-muslgnueabi-gcc... (cached) gcc3
checking pkg-config is at least version 0.9.0... yes
checking for libcurl... yes
checking for microxml... yes
checking how to run the C preprocessor... arm-openwrt-linux-muslgnueabi-gcc -E
checking for grep that handles long lines and -e... /home/fl/tmp/rutos-ipq40xx-rutx-gpl/staging_dir/host/bin/grep
checking for egrep... /home/fl/tmp/rutos-ipq40xx-rutx-gpl/staging_dir/host/bin/grep -E
checking for ANSI C header files... yes
checking for sys/types.h... yes
checking for sys/stat.h... yes
checking for stdlib.h... yes
checking for string.h... yes
checking for memory.h... yes
checking for strings.h... yes
checking for inttypes.h... yes
checking for stdint.h... yes
checking for unistd.h... yes
checking for stdlib.h... (cached) yes
checking for string.h... (cached) yes
checking for uint8_t... yes
checking that generated files are newer than configure... done
configure: creating ./config.status
config.status: error: cannot find input file: `Makefile.in'
make[3]: *** [Makefile:114: /home/fl/tmp/rutos-ipq40xx-rutx-gpl/build_dir/target-arm_cortex-a7+neon-vfpv4_musl_eabi/easycwmp-f7fbee5af227d95aba001ba30b1bb03dddebeac8-2020-12-22/.configured_b64c0d38def55e680dae79c7d5a84d38] Error 1
make[3]: Leaving directory '/home/fl/tmp/rutos-ipq40xx-rutx-gpl/package/teltonika/easycwmp'
time: package/teltonika/easycwmp/compile#2.62#1.54#4.81
make[2]: *** [package/Makefile:125: package/teltonika/easycwmp/compile] Error 2
make[2]: Leaving directory '/home/fl/tmp/rutos-ipq40xx-rutx-gpl'
make[1]: *** [package/Makefile:119: /home/fl/tmp/rutos-ipq40xx-rutx-gpl/staging_dir/target-arm_cortex-a7+neon-vfpv4_musl_eabi/stamp/.package_compile] Error 2
make[1]: Leaving directory '/home/fl/tmp/rutos-ipq40xx-rutx-gpl'
make: *** [/home/fl/tmp/rutos-ipq40xx-rutx-gpl/include/toplevel.mk:231: world] Error 2